{"text_format":"1","workbook":"xlsx","n_sheets":6,"sheets":["Results","800 Regimes","Calc","Sunrise_set","Switch Regime Entry","Dropdowns"],"not_rendered":{"charts":0,"images":0,"macros":1,"external_links":0,"defined_names":5,"comments":0,"pivot_tables":0},"unopened":[],"bounds":{"document_bytes":16777216,"sheet_cells":100000,"rows_first":2000,"rows_last":500,"rows_between":2000,"halvings":0,"cell_chars":16384,"cell_head_chars":4096},"cells_cut":0,"cells_raw":0,"read":"whole","date_system":"1900"}

{"sheet":"Results","index":0,"n_rows":9,"n_cols":30,"rows_kept":9,"cut":false,"hidden":true,"merged":[[0,2,0,15]]}
[null,null,"GSP Group Name"]
["Regime","Period","Eastern","East Midlands","London","Merseyside & North Wales","Midlands","Northern","North Western","Southern","South Eastern","South Wales","South Western","Yorkshire","South Scotland","North Scotland","After Sunset","Before Sunrise","Lux On","Lux Off","Intermediate Off","Intermediate On","Switch On","Switch Off","Switch Class","Category","Status","Default Switch Regime","Effective From Date","Effective To Date"]
[null,null,null,null,null,null,null,null,null,null,null,null,null,null,null,null,null,null,null,null,null,null,null,null,"V","B","P"]
[null,null,null,null,null,null,null,null,null,null,null,null,null,null,null,null,null,null,null,null,null,null,null,null,"V","B","P"]
[null,null,{"$f":"VLOOKUP(#REF!,lookupPECU,4,FALSE)","v":{"$error":"#REF!"}},{"$f":"VLOOKUP(#REF!,lookupPECU,5,FALSE)","v":{"$error":"#REF!"}},{"$f":"VLOOKUP(#REF!,lookupPECU,6,FALSE)","v":{"$error":"#REF!"}},{"$f":"VLOOKUP(#REF!,lookupPECU,7,FALSE)","v":{"$error":"#REF!"}},{"$f":"VLOOKUP(#REF!,lookupPECU,8,FALSE)","v":{"$error":"#REF!"}},{"$f":"VLOOKUP(#REF!,lookupPECU,9,FALSE)","v":{"$error":"#REF!"}},{"$f":"VLOOKUP(#REF!,lookupPECU,10,FALSE)","v":{"$error":"#REF!"}},{"$f":"VLOOKUP(#REF!,lookupPECU,11,FALSE)","v":{"$error":"#REF!"}},{"$f":"VLOOKUP(#REF!,lookupPECU,12,FALSE)","v":{"$error":"#REF!"}},{"$f":"VLOOKUP(#REF!,lookupPECU,13,FALSE)","v":{"$error":"#REF!"}},{"$f":"VLOOKUP(#REF!,lookupPECU,14,FALSE)","v":{"$error":"#REF!"}},{"$f":"VLOOKUP(#REF!,lookupPECU,15,FALSE)","v":{"$error":"#REF!"}},{"$f":"VLOOKUP(#REF!,lookupPECU,16,FALSE)","v":{"$error":"#REF!"}},{"$f":"VLOOKUP(#REF!,lookupPECU,17,FALSE)","v":{"$error":"#REF!"}},null,null,null,null,null,null,null,null,"P","B","P"]
[]
[]
[]
[null," "]

{"sheet":"800 Regimes","index":1,"n_rows":26,"n_cols":30,"rows_kept":26,"cut":false,"hidden":true,"merged":[]}
[null,"Regime","Period","Eastern","East Midlands","London","Merseyside & North Wales","Midlands","Northern","North Western","Southern","South Eastern","South Wales","South Western","Yorkshire","South Scotland","North Scotland","After Sunset","Before Sunrise","Lux On","Lux Off","Intermediate Off","Intermediate On","Switch On","Switch Off","Switch Class","Category","Status","Default Switch Regime","Effective From Date"]
["20/20",806,"Electronic PEC  20/20",4092,4089,4094,4088,4091,4082,4087,4095,4095,4093,4096,4086,4078,4071,null,null,20,20,null,null,null,null,"P","B","P",205,"2011-04-05"]
["35/35",807,"Electronic PEC  35/35",4119,4117,4121,4115,4118,4109,4115,4122,4122,4120,4124,4113,4106,4098,null,null,35,35,null,null,null,null,"P","B","P",205,"2011-04-05"]
["35/18",808,"Electronic PEC  35/18",4103,4101,4106,4100,4103,4094,4099,4107,4107,4105,4108,4098,4090,4083,null,null,35,18,null,null,null,null,"P","B","P",205,"2011-04-05"]
["40/60",809,"Electronic PEC  40/60",4146,4144,4149,4143,4145,4137,4142,4150,4150,4148,4151,4141,4133,4126,null,null,40,60,null,null,null,null,"P","B","P",206,"2011-04-05"]
["40/20",810,"Electronic PEC  40/20",4110,4107,4112,4106,4109,4100,4106,4113,4113,4111,4114,4104,4097,4089,null,null,40,20,null,null,null,null,"P","B","P",205,"2011-04-05"]
["55/28",811,"Electronic PEC  55/28",4131,4128,4133,4127,4130,4121,4127,4134,4134,4132,4135,4125,4118,4110,null,null,55,28,null,null,null,null,"P","B","P",206,"2011-04-05"]
["55/55",812,"Electronic PEC  55/55",4155,4153,4158,4152,4155,4146,4151,4159,4159,4157,4160,4150,4142,4135,null,null,55,55,null,null,null,null,"P","B","P",206,"2011-04-05"]
["55/83",813,"Electronic PEC  55/83",4181,4179,4183,4177,4180,4171,4177,4184,4184,4182,4186,4175,4168,4160,null,null,55,83,null,null,null,null,"P","B","P",208,"2011-04-05"]
["70/35",821,"Electronic PEC  70/35",4151,4149,4153,4147,4150,4141,4147,4154,4154,4152,4156,4145,4138,4130,null,null,70,35,null,null,null,null,"P","B","P",206,"2011-04-05"]
["70/70",822,"Electronic PEC  70/70",4183,4180,4185,4179,4182,4173,4179,4186,4186,4184,4187,4177,4170,4162,null,null,70,70,null,null,null,null,"P","B","P",208,"2011-04-05"]
["70/135",823,"Electronic PEC  70/135",4242,4240,4244,4238,4241,4233,4238,4245,4246,4243,4247,4236,4229,4221,null,null,70,135,null,null,null,null,"P","B","P",207,"2011-04-05"]
["70/140",824,"Electronic PEC  70/140",4247,4244,4249,4243,4246,4237,4243,4250,4250,4248,4251,4241,4234,4226,null,null,70,140,null,null,null,null,"P","B","P",207,"2011-04-05"]
["70/50",825,"Electronic PEC  70/50",4165,4162,4167,4161,4164,4155,4160,4168,4168,4166,4169,4159,4151,4144,null,null,70,50,null,null,null,null,"P","B","P",208,"2011-04-05"]
["70/55",826,"Electronic PEC  70/55",4169,4167,4171,4165,4168,4160,4165,4172,4173,4170,4174,4163,4156,4148,null,null,70,55,null,null,null,null,"P","B","P",208,"2011-04-05"]
["80/20",835,"Electronic PEC  80/20",4146.3631950252457,4143.996528358578,4148.6631950252449,4142.6631950252449,4145.4131950252449,4136.7131950252451,4142.1631950252449,4149.5631950252446,4149.7965283585781,4147.5631950252446,4150.996528358578,4140.579861691911,4133.1298616919112,4125.6465283585785,null,null,80,20,null,null,null,null,"P","B","P",null,"2017-05-17"]
["100/50",831,"Electronic PEC  100/50",4192,4190,4194,4188,4191,4182,4188,4195,4195,4193,4197,4186,4179,4171,null,null,100,50,null,null,null,null,"P","B","P",208,"2011-04-05"]
["100/100",832,"Electronic PEC  100/100",4238,4235,4240,4234,4237,4228,4233,4241,4241,4239,4242,4232,4224,4217,null,null,100,100,null,null,null,null,"P","B","P",207,"2011-04-05"]
["100/150",833,"Electronic PEC  100/150",4283,4281,4286,4280,4282,4274,4279,4286,4287,4284,4288,4277,4270,4263,null,null,100,150,null,null,null,null,"P","B","P",210,"2011-04-05"]
["100/200",834,"Electronic PEC  100/200",4291,4288,4293,4287,4290,4281,4287,4294,4294,4292,4295,4285,4278,4270,null,null,100,200,null,null,null,null,"P","B","P",210,"2011-04-05"]
{"$rows_left_out":7}
{"sheet":"Calc","index":2,"n_rows":367,"n_cols":27,"rows_kept":367,"cut":false,"hidden":true,"merged":[[4,28,4,29],[4,30,4,31],[4,32,4,33],[2,28,2,29],[2,30,2,31],[2,32,2,33],[3,28,3,29],[3,30,3,31],[3,32,3,33],[0,28,0,29],[0,30,0,31],[0,32,0,33],[1,28,1,29],[1,30,1,31],[1,32,1,33]]}
[null,null,null,"End mins","Start mins","GMT/CLK",null,null,"Dim end","Dim start",null,"Total Minutes (Unadjusted)",null,null,"Adjustment SR",null,"Adjustment SS",null,"Adjusted (total amount of off/dimmed time)",null,"Enter GMT or CLK",null,"GMT",null,null,1]
["2011-04-01",{"$f":"Sunrise_set!AE3","v":545},{"$f":"Sunrise_set!AF3","v":1858},{"$f":"LEFT(B2,1)*60+RIGHT(B2,2)+F2-$V$17","v":{"$error":"#REF!"}},{"$f":"LEFT(C2,2)*60+RIGHT(C2,2)+F2+$V$17","v":{"$error":"#REF!"}},{"$f":"IF($W$1=\"CLK\",60,0)","v":0},null,null,{"$f":"$W$6*60+$X$6","v":660},{"$f":"IF($W$7<12,($W$7+24)*60+$X$7,$W$7*60+$X$7)","v":1740},null,{"$f":"IF(AND($W$7>12,$W$6>12),I2-J2,(24*60)-J2+I2)","v":360},null,null,{"$f":"IF(AND($W$6>12,$W$7>12),0,IF(D2>I2,0,I2-D2))","v":{"$error":"#REF!"}},null,{"$f":"IF(E2>J2,E2-J2,0)","v":{"$error":"#REF!"}},null,{"$f":"MAX(L2-SUM(O2,Q2),0)","v":{"$error":"#REF!"}},{"$f":"S2/60","v":{"$error":"#REF!"}}]
["2011-04-02",{"$f":"Sunrise_set!AE4","v":542},{"$f":"Sunrise_set!AF4","v":1900},{"$f":"LEFT(B3,1)*60+RIGHT(B3,2)+F3-$V$17","v":{"$error":"#REF!"}},{"$f":"LEFT(C3,2)*60+RIGHT(C3,2)+F3+$V$17","v":{"$error":"#REF!"}},{"$f":"IF($W$1=\"CLK\",60,0)","v":0},null,null,{"$f":"$W$6*60+$X$6","v":660},{"$f":"IF($W$7<12,($W$7+24)*60+$X$7,$W$7*60+$X$7)","v":1740},null,{"$f":"IF(AND($W$7>12,$W$6>12),I3-J3,(24*60)-J3+I3)","v":360},null,null,{"$f":"IF(AND($W$6>12,$W$7>12),0,IF(D3>I3,0,I3-D3))","v":{"$error":"#REF!"}},null,{"$error":"#REF!"},null,{"$f":"MAX(L3-SUM(O3,Q3),0)","v":{"$error":"#REF!"}}]
["2011-04-03",{"$f":"Sunrise_set!AE5","v":539},{"$f":"Sunrise_set!AF5","v":1902},{"$f":"LEFT(B4,1)*60+RIGHT(B4,2)+F4-$V$17","v":{"$error":"#REF!"}},{"$f":"LEFT(C4,2)*60+RIGHT(C4,2)+F4+$V$17","v":{"$error":"#REF!"}},0,null,null,{"$f":"$W$6*60+$X$6","v":660},1740,null,360,null,null,{"$error":"#REF!"},null,{"$error":"#REF!"},null,{"$error":"#REF!"}]
["2011-04-04",{"$f":"Sunrise_set!AE6","v":537},{"$f":"Sunrise_set!AF6","v":1904},{"$error":"#REF!"},{"$f":"LEFT(C5,2)*60+RIGHT(C5,2)+F5+$V$17","v":{"$error":"#REF!"}},0,null,null,{"$f":"$W$6*60+$X$6","v":660},1740,null,{"$f":"IF(AND($W$7>12,$W$6>12),I5-J5,(24*60)-J5+I5)","v":360},null,null,{"$f":"IF(AND($W$6>12,$W$7>12),0,IF(D5>I5,0,I5-D5))","v":{"$error":"#REF!"}},null,{"$error":"#REF!"},null,{"$error":"#REF!"},null,null,null,"Hours","Minutes"]
["2011-04-05",{"$f":"Sunrise_set!AE7","v":534},{"$f":"Sunrise_set!AF7","v":1906},{"$error":"#REF!"},{"$error":"#REF!"},0,null,null,660,1740,null,360,null,null,{"$error":"#REF!"},null,{"$error":"#REF!"},null,{"$error":"#REF!"},null,"Enter Dim End",null,11,0]
["2011-04-06",{"$f":"Sunrise_set!AE8","v":531},{"$f":"Sunrise_set!AF8","v":1909},{"$error":"#REF!"},{"$error":"#REF!"},0,null,null,660,1740,null,360,null,null,{"$error":"#REF!"},null,{"$error":"#REF!"},null,{"$error":"#REF!"},null,"Enter Dim Start",null,5,0]
["2011-04-07",{"$f":"Sunrise_set!AE9","v":528},{"$f":"Sunrise_set!AF9","v":1911},{"$error":"#REF!"},{"$error":"#REF!"},0,null,null,660,1740,null,360,null,null,{"$error":"#REF!"},null,{"$error":"#REF!"},null,{"$error":"#REF!"},null,null,null,"_P",null,{"$f":"VLOOKUP(W8,look2,2)","v":27},{"$f":"Y8+1","v":28}]
["2011-04-08",{"$f":"Sunrise_set!AE10","v":526},{"$f":"Sunrise_set!AF10","v":1913},{"$error":"#REF!"},{"$error":"#REF!"},0,null,null,660,1740,null,360,null,null,{"$error":"#REF!"},null,{"$error":"#REF!"},null,{"$error":"#REF!"}]
["2011-04-09",{"$f":"Sunrise_set!AE11","v":523},{"$f":"Sunrise_set!AF11","v":1915},{"$error":"#REF!"},{"$error":"#REF!"},0,null,null,660,1740,null,360,null,null,{"$error":"#REF!"},null,{"$error":"#REF!"},null,{"$error":"#REF!"},null,"Dimmed Hours"]
["2011-04-10",{"$f":"Sunrise_set!AE12","v":520},{"$f":"Sunrise_set!AF12","v":1917},{"$error":"#REF!"},{"$error":"#REF!"},0,null,null,660,1740,null,360,null,null,{"$error":"#REF!"},null,{"$error":"#REF!"},null,{"$error":"#REF!"},null,{"$f":"SUM(S2:S367)/60","v":{"$error":"#REF!"}}]
["2011-04-11",{"$f":"Sunrise_set!AE13","v":518},{"$f":"Sunrise_set!AF13","v":1920},{"$error":"#REF!"},{"$error":"#REF!"},0,null,null,660,1740,null,360,null,null,{"$error":"#REF!"},null,{"$error":"#REF!"},null,{"$error":"#REF!"}]
["2011-04-12",{"$f":"Sunrise_set!AE14","v":515},{"$f":"Sunrise_set!AF14","v":1922},{"$error":"#REF!"},{"$error":"#REF!"},0,null,null,660,1740,null,360,null,null,{"$error":"#REF!"},null,{"$error":"#REF!"},null,{"$error":"#REF!"},null,"avg published",{"$f":"AVERAGE(Results!C5:P5)","v":{"$error":"#REF!"}},null,"lookup"]
["2011-04-13",{"$f":"Sunrise_set!AE15","v":512},{"$f":"Sunrise_set!AF15","v":1924},{"$error":"#REF!"},{"$error":"#REF!"},0,null,null,660,1740,null,360,null,null,{"$error":"#REF!"},null,{"$error":"#REF!"},null,{"$error":"#REF!"},null,"Avg SS to SR",4277.8571428571404,null,"_A",1]
["2011-04-14",{"$f":"Sunrise_set!AE16","v":510},{"$f":"Sunrise_set!AF16","v":1926},{"$error":"#REF!"},{"$error":"#REF!"},0,null,null,660,1740,null,360,null,null,{"$error":"#REF!"},null,{"$error":"#REF!"},null,{"$error":"#REF!"},null,"Diff hrs",{"$f":"V14-V13","v":{"$error":"#REF!"}},null,"_B",3]
["2011-04-15",{"$f":"Sunrise_set!AE17","v":507},{"$f":"Sunrise_set!AF17","v":1928},{"$error":"#REF!"},{"$error":"#REF!"},0,null,null,660,1740,null,360,null,null,{"$error":"#REF!"},null,{"$error":"#REF!"},null,{"$error":"#REF!"},null,"mins per day",{"$f":"V15*60/365","v":{"$error":"#REF!"}},null,"_C",5]
["2011-04-16",{"$f":"Sunrise_set!AE18","v":504},{"$f":"Sunrise_set!AF18","v":1930},{"$error":"#REF!"},{"$error":"#REF!"},0,null,null,660,1740,null,360,null,null,{"$error":"#REF!"},null,{"$error":"#REF!"},null,{"$error":"#REF!"},null,"each end",{"$f":"V16/2","v":{"$error":"#REF!"}},null,"_D",7]
["2011-04-17",{"$f":"Sunrise_set!AE19","v":502},{"$f":"Sunrise_set!AF19","v":1933},{"$error":"#REF!"},{"$error":"#REF!"},0,null,null,660,1740,null,360,null,null,{"$error":"#REF!"},null,{"$error":"#REF!"},null,{"$error":"#REF!"},null,null,null,null,"_E",9]
["2011-04-18",{"$f":"Sunrise_set!AE20","v":459},{"$f":"Sunrise_set!AF20","v":1935},{"$error":"#REF!"},{"$error":"#REF!"},0,null,null,660,1740,null,360,null,null,{"$error":"#REF!"},null,{"$error":"#REF!"},null,{"$error":"#REF!"},null,null,null,null,"_F",11]
["2011-04-19",{"$f":"Sunrise_set!AE21","v":456},{"$f":"Sunrise_set!AF21","v":1937},{"$error":"#REF!"},{"$error":"#REF!"},0,null,null,660,1740,null,360,null,null,{"$error":"#REF!"},null,{"$error":"#REF!"},null,{"$error":"#REF!"},null,null,null,null,"_G",13]
{"$rows_left_out":348}
{"sheet":"Sunrise_set","index":3,"n_rows":368,"n_cols":32,"rows_kept":368,"cut":false,"hidden":true,"merged":[]}
[null,1,2,3,4,5,6,7,8,9,10,11,12,13,14,15,16,17,18,19,20,21,22,23,24,25,26,27,28]
[null,"_A","_A","_B","_B","_C","_C","_D","_D","_E","_E","_F","_F","_G","_G","_H","_H","_J","_J","_K","_K","_L","_L","_M","_M","_N","_N","_P","_P"]
[1,531,1832,538,1840,535,1835,547,1850,541,1842,537,1844,542,1845,541,1839,534,1832,552,1852,550,1847,539,1843,547,1856,545,1858,null,{"$f":"HLOOKUP(Calc!$Y$8,look1,Sunrise_set!A3+2)","v":545},{"$f":"HLOOKUP(Calc!$Z$8,look1,Sunrise_set!A3+2)","v":1858}]
[2,529,1833,536,1842,533,1836,544,1852,539,1844,535,1846,539,1847,539,1841,532,1834,549,1853,547,1849,536,1845,544,1858,542,1900,null,{"$f":"HLOOKUP(Calc!$Y$8,look1,Sunrise_set!A4+2)","v":542},{"$f":"HLOOKUP(Calc!$Z$8,look1,Sunrise_set!A4+2)","v":1900}]
[3,527,1835,533,1844,531,1838,542,1853,536,1846,532,1848,537,1849,536,1843,530,1836,547,1855,545,1850,534,1846,542,1900,539,1902,null,{"$f":"HLOOKUP(Calc!$Y$8,look1,Sunrise_set!A5+2)","v":539},{"$f":"HLOOKUP(Calc!$Z$8,look1,Sunrise_set!A5+2)","v":1902}]
[4,524,1837,531,1845,529,1840,540,1855,534,1847,530,1850,535,1850,534,1844,527,1837,545,1857,543,1852,531,1848,539,1902,537,1904,null,{"$f":"HLOOKUP(Calc!$Y$8,look1,Sunrise_set!A6+2)","v":537},{"$f":"HLOOKUP(Calc!$Z$8,look1,Sunrise_set!A6+2)","v":1904}]
[5,522,1839,529,1847,526,1841,537,1857,532,1849,527,1852,532,1852,532,1846,525,1839,543,1858,541,1854,529,1850,537,1904,534,1906,null,{"$f":"HLOOKUP(Calc!$Y$8,look1,Sunrise_set!A7+2)","v":534},{"$f":"HLOOKUP(Calc!$Z$8,look1,Sunrise_set!A7+2)","v":1906}]
[6,520,1840,526,1849,524,1843,535,1859,529,1851,525,1854,530,1854,530,1848,523,1841,540,1900,539,1855,527,1852,534,1906,531,1909,null,{"$f":"HLOOKUP(Calc!$Y$8,look1,Sunrise_set!A8+2)","v":531},{"$f":"HLOOKUP(Calc!$Z$8,look1,Sunrise_set!A8+2)","v":1909}]
[7,517,1842,524,1851,522,1845,533,1901,527,1853,522,1856,527,1856,528,1849,521,1842,538,1902,536,1857,524,1854,531,1908,528,1911,null,{"$f":"HLOOKUP(Calc!$Y$8,look1,Sunrise_set!A9+2)","v":528},{"$f":"HLOOKUP(Calc!$Z$8,look1,Sunrise_set!A9+2)","v":1911}]
[8,515,1844,521,1853,520,1846,530,1902,525,1854,520,1858,525,1858,525,1851,519,1844,536,1903,534,1859,522,1856,529,1910,526,1913,null,{"$f":"HLOOKUP(Calc!$Y$8,look1,Sunrise_set!A10+2)","v":526},{"$f":"HLOOKUP(Calc!$Z$8,look1,Sunrise_set!A10+2)","v":1913}]
[9,513,1846,519,1854,518,1848,528,1904,523,1856,517,1900,523,1900,523,1853,516,1846,534,1905,532,1900,519,1857,526,1912,523,1915,null,{"$f":"HLOOKUP(Calc!$Y$8,look1,Sunrise_set!A11+2)","v":523},{"$f":"HLOOKUP(Calc!$Z$8,look1,Sunrise_set!A11+2)","v":1915}]
[10,511,1847,517,1856,515,1850,525,1906,520,1858,515,1902,520,1901,521,1854,514,1847,531,1907,530,1902,517,1859,524,1914,520,1917,null,{"$f":"HLOOKUP(Calc!$Y$8,look1,Sunrise_set!A12+2)","v":520},{"$f":"HLOOKUP(Calc!$Z$8,look1,Sunrise_set!A12+2)","v":1917}]
[11,508,1849,515,1858,513,1851,523,1908,518,1900,512,1903,518,1903,519,1856,512,1849,529,1909,528,1903,515,1901,521,1916,518,1920,null,{"$f":"HLOOKUP(Calc!$Y$8,look1,Sunrise_set!A13+2)","v":518},{"$f":"HLOOKUP(Calc!$Z$8,look1,Sunrise_set!A13+2)","v":1920}]
[12,506,1851,512,1900,511,1853,521,1910,516,1901,510,1905,516,1905,517,1858,510,1851,527,1910,526,1905,512,1903,519,1918,515,1922,null,{"$f":"HLOOKUP(Calc!$Y$8,look1,Sunrise_set!A14+2)","v":515},{"$f":"HLOOKUP(Calc!$Z$8,look1,Sunrise_set!A14+2)","v":1922}]
[13,504,1852,510,1901,509,1855,518,1911,513,1903,507,1907,513,1907,514,1859,508,1852,525,1912,524,1907,510,1905,516,1920,512,1924,null,{"$f":"HLOOKUP(Calc!$Y$8,look1,Sunrise_set!A15+2)","v":512},{"$f":"HLOOKUP(Calc!$Z$8,look1,Sunrise_set!A15+2)","v":1924}]
[14,502,1854,508,1903,507,1856,516,1913,511,1905,505,1909,511,1909,512,1901,506,1854,522,1914,521,1908,508,1907,513,1922,510,1926,null,{"$f":"HLOOKUP(Calc!$Y$8,look1,Sunrise_set!A16+2)","v":510},{"$f":"HLOOKUP(Calc!$Z$8,look1,Sunrise_set!A16+2)","v":1926}]
[15,459,1856,505,1905,504,1858,514,1915,509,1907,503,1911,509,1911,510,1903,503,1855,520,1915,519,1910,505,1909,511,1924,507,1928,null,{"$f":"HLOOKUP(Calc!$Y$8,look1,Sunrise_set!A17+2)","v":507},{"$f":"HLOOKUP(Calc!$Z$8,look1,Sunrise_set!A17+2)","v":1928}]
[16,457,1858,503,1907,502,1900,512,1917,507,1908,500,1913,506,1912,508,1904,501,1857,518,1917,517,1911,503,1910,508,1926,504,1930,null,{"$f":"HLOOKUP(Calc!$Y$8,look1,Sunrise_set!A18+2)","v":504},{"$f":"HLOOKUP(Calc!$Z$8,look1,Sunrise_set!A18+2)","v":1930}]
[17,455,1859,501,1909,500,1901,509,1919,505,1910,458,1915,504,1914,506,1906,459,1859,516,1919,515,1913,501,1912,506,1928,502,1933,null,{"$f":"HLOOKUP(Calc!$Y$8,look1,Sunrise_set!A19+2)","v":502},{"$f":"HLOOKUP(Calc!$Z$8,look1,Sunrise_set!A19+2)","v":1933}]
[18,453,1901,459,1910,458,1903,507,1920,502,1912,455,1917,502,1916,504,1908,457,1900,514,1920,513,1915,458,1914,504,1930,459,1935,null,{"$f":"HLOOKUP(Calc!$Y$8,look1,Sunrise_set!A20+2)","v":459},{"$f":"HLOOKUP(Calc!$Z$8,look1,Sunrise_set!A20+2)","v":1935}]
{"$rows_left_out":349}
{"sheet":"Switch Regime Entry","index":4,"n_rows":3,"n_cols":31,"rows_kept":3,"cut":false,"hidden":false,"merged":[[0,2,0,15]]}
[null,null,"GSP Group Name"]
["Regime","Period","Eastern","East Midlands","London","Merseyside & North Wales","Midlands","Northern","North Western","Southern","South Eastern","South Wales","South Western","Yorkshire","South Scotland","North Scotland","After Sunset","Before Sunrise","Lux On","Lux Off","Intermediate Off","Intermediate On","Switch On","Switch Off","Switch Class","Category","Status","Default Switch Regime","GMT/CLK","Effective From Date","Effective To Date"]
["F19","Variable Power Switch Regime - (GMT)",2120,2115,2117,2111,2115,2115,2113,2115,2118,2110,2111,2115,2110,2110,null,null,20,20,null,null,null,null,"P","B","P",null,"GMT","2018-12-19"]

{"sheet":"Dropdowns","index":5,"n_rows":25,"n_cols":4,"rows_kept":25,"cut":false,"hidden":true,"merged":[]}
["CLK",0,0,0]
["GMT",30,1,5]
[null,null,2,10]
[null,null,3,15]
[null,null,4,20]
[null,null,5,25]
[null,null,6,30]
[null,null,7,35]
[null,null,8,40]
[null,null,9,45]
[null,null,10,50]
[null,null,11,55]
[null,null,12,60]
[null,null,13,65]
[null,null,14,70]
[null,null,15,75]
[null,null,16,80]
[null,null,17,85]
[null,null,18,90]
[null,null,19,95]
{"$rows_left_out":5}